AXI总线五通道信号详解:从握手协议到RTL实现的关键技术
1. 为什么AXI通道信号值得单独拎出来啃做FPGA或者SoC验证的人迟早会撞上AXI总线。你可能已经用过现成的AXI IP核调调参数就能跑但一旦遇到仿真波形里握手信号死活不拉高、突发传输中途断流、或者读写通道互相卡死的情况如果对五个通道各自的信号职责没有清晰的认知排查起来就跟盲人摸象一样。我见过不少同行代码写得飞快但一上板子发现DDR读写带宽只有理论值的三分之一最后定位到是写响应通道的Bready被意外拉低导致写事务堆积。这类问题根子不在逻辑设计而在对AXI通道协议信号的理解深度不够。AXI全称Advanced eXtensible Interface是ARM AMBA系列里面向高性能片上互连的协议标准。它最核心的设计哲学是通道分离和单向握手。所谓通道分离就是把读地址、读数据、写地址、写数据、写响应这五件事拆成五条独立的物理通道每条通道只负责一件事互不干扰。单向握手则是指每条通道上的valid和ready信号只由固定的主从角色驱动valid永远由发起方拉高ready永远由接收方拉高两者同时为高的那个时钟上升沿就是一次成功的传输。这套机制的好处是显而易见的读写可以并行地址和数据可以流水主设备不需要等待从设备的即时响应就能连续发起多个事务。但代价也很明显——信号数量多通道之间的依赖关系需要仔细梳理否则很容易出现死锁或者性能瓶颈。这篇内容就是把我自己在实际项目中梳理AXI各通道信号时踩过的坑、总结的方法、以及一些容易被忽略的细节完整地记录下来。不管你是刚接触AXI的新手还是已经用过几轮但总觉得理解不够透彻的老手应该都能从中找到一些有用的东西。2. 五条通道各自的信号清单与角色划分2.1 全局信号不是通道但缺了它什么都跑不起来在拆解五条通道之前必须先说清楚全局信号。AXI的全局信号只有两个ACLK和ARESETn。ACLK是全局时钟所有通道的传输都同步于这个时钟的上升沿。ARESETn是低电平有效的全局复位信号注意它是异步复位、同步释放的典型用法——复位拉低时可以异步生效但释放时必须与ACLK同步否则可能导致不同通道的复位释放时刻不一致进而引发握手信号的亚稳态问题。这里有一个实操中很容易被忽略的点ARESETn拉低期间所有valid信号必须被驱动为低电平所有ready信号的状态则无所谓因为复位期间不进行任何有效传输。但如果你在复位释放后的第一个时钟周期就立刻拉高valid而对应的ready信号还处于不确定状态仿真器可能会报出协议违例。稳妥的做法是在复位释放后至少等待一个时钟周期再开始发起传输。2.2 写地址通道AW开头的那些信号写地址通道负责把一次写事务的目标地址和控制信息从主设备传递给从设备。信号名统一以AW开头核心成员包括AWID写事务的ID标签用于区分不同的事务流。从设备需要把这个ID原样通过BID返回主设备才能把写响应和对应的写事务匹配起来。AWADDR写目标地址位宽由地址空间决定通常是32位或64位。AWLEN突发长度表示本次写事务要传输多少个数据拍。注意这个字段是实际拍数减一所以AWLEN为0表示1拍AWLEN为15表示16拍。这个减一的编码方式在第一次接触时很容易搞错。AWSIZE每拍传输的字节数以2的幂次表示。比如AWSIZE为2表示每拍4字节为3表示每拍8字节。AWBURST突发类型常见的有FIXED、INCR和WRAP三种。INCR是最常用的递增模式WRAP用于缓存行填充等场景FIXED则用于对固定地址的反复访问。AWVALID/AWREADY握手信号AWVALID由主设备驱动AWREADY由从设备驱动。AWLOCK、AWCACHE、AWPROT、AWQOS、AWREGION这些是可选信号分别用于锁定传输、缓存属性、保护属性、服务质量和大区域地址扩展。在简单的SoC内部互连中这些信号经常被省略或者接固定值。写地址通道的一个关键特性是它只负责传递地址和控制信息不携带任何数据。数据走的是独立的写数据通道。这意味着主设备可以在发出写地址之后不等数据准备好就先发地址实现地址和数据的流水化。2.3 写数据通道W开头的信号与字节选通写数据通道负责把实际要写入的数据从主设备搬运到从设备。信号以W开头WID写数据ID在AXI4中这个信号被移除了因为AXI4要求写数据必须与写地址按顺序对应。但在AXI3中WID是存在的用于支持写数据乱序到达。WDATA写数据本体位宽通常是32位、64位、128位或256位。WSTRB字节选通信号每一位对应WDATA中的一个字节。WSTRB为1表示对应字节有效为0表示对应字节不写入。这个信号在部分写场景中非常关键比如只更新一个32位寄存器中的某几个字节。WLAST表示当前数据拍是本次突发传输的最后一拍。从设备通过WLAST来判断一个写数据突发何时结束。WVALID/WREADY握手信号WVALID由主设备驱动WREADY由从设备驱动。写数据通道有一个非常重要的约束WLAST必须与AWLEN匹配。如果AWLEN指示本次突发有16拍那么WLAST必须且只能在第16拍时拉高。如果WLAST提前拉高或者延后拉高都属于协议违例。我在实际调试中遇到过因为WLAST提前一拍拉高导致从设备只写入了部分数据而主设备以为整个突发已经完成最终数据不一致的问题。2.4 写响应通道B开头的信号与事务完成确认写响应通道是五条通道中结构最简单的一条它只负责从从设备向主设备返回写事务的完成状态。信号以B开头BID写响应ID必须与对应的AWID一致。BRESP写响应状态常见的有OKAY、EXOKAY、SLVERR和DECERR四种。OKAY表示正常完成EXOKAY表示独占访问成功SLVERR表示从设备错误DECERR表示解码错误。BVALID/BREADY握手信号BVALID由从设备驱动BREADY由主设备驱动。写响应通道的关键规则是从设备必须在接收到完整的写数据突发之后才能返回写响应。也就是说BVALID的拉高时刻不能早于WLAST被握手的那一刻。这个规则保证了主设备在收到写响应时可以确信数据已经被从设备完整接收。另外写响应是针对整个写事务的而不是针对每一拍数据的所以一次写突发只对应一个写响应。2.5 读地址通道AR开头的信号读地址通道与写地址通道在结构上高度对称信号以AR开头ARID读事务ID。ARADDR读目标地址。ARLEN读突发长度同样是实际拍数减一。ARSIZE每拍读取的字节数。ARBURST读突发类型。ARVALID/ARREADY握手信号。ARLOCK、ARCACHE、ARPROT、ARQOS、ARREGION可选信号含义与写地址通道对应信号一致。读地址通道只负责传递读请求的地址和控制信息不携带数据。从设备在接收到读地址后需要根据地址和控制信息准备数据然后通过读数据通道返回。2.6 读数据通道R开头的信号与最后拍标志读数据通道负责把从设备读取的数据返回给主设备。信号以R开头RID读数据ID必须与对应的ARID一致。RDATA读数据本体。RRESP读响应状态含义与BRESP相同。RLAST表示当前数据拍是本次读突发的最后一拍。RVALID/RREADY握手信号RVALID由从设备驱动RREADY由主设备驱动。读数据通道与写数据通道的一个显著区别是读数据通道同时携带数据和响应状态。每一拍读数据都附带一个RRESP表示该拍数据的读取状态。而写操作中数据走写数据通道响应走写响应通道两者是分离的。这个差异在实现从设备时需要特别注意。3. 握手信号的底层逻辑与常见误用3.1 valid和ready的依赖关系谁等谁谁不能等谁AXI协议对valid和ready的依赖关系有明确规定valid不能等待ready。也就是说主设备在拉高valid之前不能先去看ready是否为高。valid的拉高只能取决于主设备自身的数据是否准备好而不能取决于从设备的ready状态。反过来ready可以等待valid也可以不等待valid——从设备可以随时拉高ready表示自己有能力接收数据也可以等到valid拉高后再拉高ready。这条规则的意义在于避免死锁。如果双方都等对方先拉高那就永远等不到。协议通过强制valid不能等ready打破了这种循环等待。但在实际实现中有些设计者为了省事会在状态机里写成“如果ready为高则拉高valid”这就违反了协议。仿真时可能因为测试激励的随机性碰巧没暴露问题但一旦遇到特定的时序组合就会直接死锁。3.2 握手成功的判定与数据传输的时机握手成功的判定条件非常简单在ACLK的上升沿valid和ready同时为高。这个上升沿就是数据传输发生的时刻。对于写数据通道WDATA、WSTRB、WLAST在握手成功的那个上升沿被从设备采样。对于读数据通道RDATA、RRESP、RLAST在握手成功的那个上升沿被主设备采样。这里有一个细节值得注意valid和ready同时为高的那个时钟周期数据信号必须保持稳定。也就是说主设备不能在拉高valid的同时还在修改WDATA从设备也不能在拉高ready的同时还在修改RDATA。数据信号必须在valid拉高之前就已经稳定并保持到握手完成。3.3 反压场景下的信号行为反压是指接收方通过拉低ready来暂停数据传输。在反压期间发送方的valid必须保持高电平不能因为ready为低就撤销valid。同时发送方的数据信号也必须保持不变不能因为被反压就改变数据内容。这个规则保证了接收方在ready重新拉高时能够正确地采样到之前被反压的那拍数据。我在实际项目中遇到过一种情况主设备在valid被反压后错误地把valid拉低了一个周期再重新拉高结果从设备在valid拉低的那个周期误以为传输被取消状态机发生了错乱。这种问题在波形上表现为valid信号出现毛刺排查时需要仔细观察valid的连续性。4. 突发传输机制地址计算与边界处理4.1 INCR突发的地址递增规律INCR是最常用的突发类型地址按照固定的步长递增。步长等于每拍传输的字节数也就是2的AWSIZE次方。比如AWSIZE为2每拍4字节起始地址为0x1000那么第一拍地址为0x1000第二拍为0x1004第三拍为0x1008以此类推。这里有一个容易踩的坑起始地址必须与传输大小对齐。如果AWSIZE为24字节起始地址必须是4的倍数。如果起始地址是0x1002那就违反了对齐规则。有些从设备会对非对齐地址做出未定义的行为有些则会直接报错。在写RTL代码时地址对齐检查应该放在从设备的地址译码阶段。4.2 WRAP突发的回绕计算WRAP突发用于缓存行填充等场景它的地址在达到一个边界后会回绕到起始地址。WRAP突发的长度只能是2、4、8或16拍起始地址必须与突发长度乘以传输大小对齐。比如一个4拍的WRAP突发每拍4字节总传输量为16字节起始地址必须是16的倍数。WRAP突发的地址计算稍微复杂一些。假设起始地址为0x10004拍每拍4字节那么地址序列为0x1000、0x1004、0x1008、0x100C。如果起始地址为0x1008同样是4拍地址序列则变为0x1008、0x100C、0x1000、0x1004。也就是说地址在达到0x1010边界后回绕到了0x1000。这个回绕行为在实现从设备时需要特别注意因为从设备的地址译码逻辑必须能够处理这种非线性的地址序列。4.3 窄传输与字节选通的配合窄传输是指传输的数据宽度小于数据总线的宽度。比如数据总线是64位但实际只需要传输32位数据。这时候就需要用到WSTRB信号来指示哪些字节有效。窄传输在AXI中是允许的但有一些约束传输的地址必须与传输大小对齐且WSTRB的有效字节必须连续。举个例子64位数据总线传输4字节数据起始地址为0x1004。那么WDATA的[63:32]位有效WSTRB为0b1100。如果起始地址为0x1002那就不是4字节对齐的属于非对齐传输AXI协议不支持这种操作。在实际设计中如果确实需要非对齐访问通常需要拆分成多次对齐传输来完成。5. 事务ID与乱序完成多线程场景下的秩序维护5.1 ID信号的作用与匹配规则AXI的ID信号是实现乱序完成的关键机制。主设备在发起事务时会给每个事务分配一个ID。从设备在处理完事务后必须把相同的ID通过响应通道返回。主设备通过ID来匹配请求和响应从而支持多个事务同时进行。ID的位宽是可配置的常见的有4位、8位等。ID位宽决定了主设备可以同时追踪多少个不同的事务流。如果ID位宽为4那么最多可以有16个不同的事务流同时进行。需要注意的是相同ID的事务必须按顺序完成不同ID的事务可以乱序完成。这个规则是AXI乱序模型的基础。5.2 读写通道ID的独立性读通道和写通道的ID是相互独立的。也就是说ARID和AWID可以使用相同的值从设备不会把它们混淆。读响应通过RID返回写响应通过BID返回主设备分别根据RID和BID来匹配对应的读事务和写事务。这个独立性在实际设计中很有用。比如一个主设备可以同时发起读事务和写事务分别使用ID 0和ID 0从设备会分别处理不会因为ID相同而产生冲突。但在实现从设备时需要为读通道和写通道分别维护ID追踪表不能共用。5.3 乱序完成的实际影响与验证方法乱序完成对从设备的设计提出了更高的要求。从设备需要能够同时处理多个不同ID的事务并且按照ID分别追踪每个事务的完成状态。对于简单的从设备比如一个单端口的SRAM控制器可能不支持乱序完成这时候它可以把所有事务都按顺序处理但必须保证相同ID的事务按顺序完成。在验证乱序完成功能时一个有效的方法是构造多个不同ID的事务让它们在从设备中交错执行然后检查响应返回的顺序是否符合预期。具体来说可以构造ID为0、1、2的三个读事务让从设备先完成ID为2的事务再完成ID为0的事务最后完成ID为1的事务。如果主设备能够正确匹配每个响应说明乱序完成机制工作正常。6. 从波形到代码一次完整的读写事务拆解6.1 写事务的完整时序链路一次完整的写事务涉及写地址通道、写数据通道和写响应通道的协同工作。典型的时序流程如下主设备在AW通道上拉高AWVALID同时给出AWID、AWADDR、AWLEN、AWSIZE、AWBURST等信号。从设备在准备好接收地址后拉高AWREADY。AWVALID和AWREADY同时为高的时钟沿地址被采样。主设备在W通道上拉高WVALID同时给出WDATA、WSTRB。对于多拍突发主设备可以连续发送多拍数据每拍数据在WVALID和WREADY同时为高时被采样。从设备在接收完最后一拍数据WLAST为高后拉高BVALID同时给出BID和BRESP。主设备拉高BREADYBVALID和BREADY同时为高的时钟沿写响应被采样写事务完成。需要注意的是写地址通道和写数据通道是独立的主设备可以先发地址再发数据也可以地址和数据同时发。从设备可以分别对AWREADY和WREADY进行控制实现地址和数据的独立反压。6.2 读事务的完整时序链路读事务涉及读地址通道和读数据通道主设备在AR通道上拉高ARVALID同时给出ARID、ARADDR、ARLEN、ARSIZE、ARBURST等信号。从设备拉高ARREADY地址被采样。从设备在准备好数据后拉高RVALID同时给出RID、RDATA、RRESP。对于多拍突发从设备连续返回多拍数据最后一拍RLAST为高。主设备拉高RREADY每拍数据在RVALID和RREADY同时为高时被采样。最后一拍数据被采样后读事务完成。读事务的一个特点是从设备可以在接收到读地址后立即返回数据也可以延迟返回。延迟返回的时间取决于从设备的数据准备时间。在实际设计中如果从设备需要多个时钟周期才能准备好数据它可以在准备好之前保持RVALID为低主设备会通过RREADY的反压来等待。6.3 用仿真波形验证协议合规性在仿真波形中验证AXI协议合规性需要重点关注以下几个方面握手信号的连续性valid拉高后在ready拉高之前不能撤销。ready拉高后在valid拉高之前也不能撤销如果ready是先拉高的。数据信号的稳定性在valid和ready同时为高之前数据信号必须保持稳定。WLAST和RLAST的正确性WLAST必须与AWLEN匹配RLAST必须与ARLEN匹配。写响应的时序BVALID必须在WLAST被握手之后才能拉高。ID的一致性BID必须与AWID一致RID必须与ARID一致。如果仿真器支持AXI协议检查器建议在测试平台中例化一个协议检查器它可以自动检测大部分协议违例。但协议检查器不能覆盖所有场景比如事务之间的依赖关系、性能相关的行为等还是需要人工分析波形。7. 几个容易翻车的细节与个人经验7.1 AWLEN和ARLEN的减一编码AWLEN和ARLEN的减一编码是新手最容易搞错的地方之一。AWLEN为0表示1拍传输为1表示2拍为255表示256拍。我在第一次写AXI从设备时就因为把AWLEN直接当成了拍数导致每次传输都少了一拍。这个bug在仿真时因为测试激励只发了单拍传输而没有暴露直到上板测试多拍突发时才被发现。建议在RTL代码中明确注释这个减一关系避免后续维护时再次踩坑。7.2 写响应不能提前返回写响应通道的BVALID必须在WLAST被握手之后才能拉高。这个规则看似简单但在实现从设备时很容易违反。比如从设备可能在接收到写地址后就开始准备写响应如果写数据通道被反压WLAST迟迟没有到达而从设备已经提前拉高了BVALID那就违反了协议。正确的做法是在从设备的状态机中明确等待WLAST握手完成后再进入写响应状态。7.3 读数据通道的RRESP每拍都要有效读数据通道的RRESP是每拍都携带的而不是只在最后一拍有效。这意味着从设备在返回每一拍读数据时都必须给出对应的RRESP。对于正常的读操作每拍的RRESP都是OKAY。如果某一拍读取出错可以在该拍的RRESP中返回SLVERR或DECERR。主设备需要检查每一拍的RRESP而不能只检查最后一拍。7.4 复位期间valid必须为低ARESETn拉低期间所有valid信号必须被驱动为低电平。这个规则在实现主设备时需要注意。有些设计者会在复位期间保持valid为高认为反正复位期间不进行传输无所谓。但协议检查器会报出违例而且如果从设备在复位释放后立即采样valid可能会误判为有效传输。稳妥的做法是在复位期间将所有valid信号强制拉低直到复位释放后的第一个时钟周期再根据状态机决定是否拉高。7.5 跨时钟域场景下的额外考量如果AXI主设备和从设备处于不同的时钟域需要在中间插入跨时钟域桥接逻辑。这时候除了基本的握手信号同步外还需要注意数据信号的同步。对于多比特数据信号不能简单地用两级触发器同步而应该使用异步FIFO或者握手同步机制。另外跨时钟域场景下valid和ready的握手时序会变得更加复杂建议在桥接逻辑中增加超时检测机制防止因为同步失败导致的死锁。8. 从协议理解到RTL实现的几个关键决策8.1 状态机设计独热码还是二进制码在实现AXI从设备的状态机时独热码和二进制码各有优劣。独热码的优点是状态译码简单每个状态只用一个触发器表示组合逻辑路径短适合高速设计。缺点是状态多的时候触发器数量会比较多。二进制码的优点是触发器数量少缺点是状态译码的组合逻辑相对复杂。对于AXI从设备这种状态数量不多通常不超过8个的场景独热码是一个不错的选择尤其是在高频设计中。8.2 数据缓冲FIFO深度怎么定AXI从设备通常需要在内部缓冲写数据或读数据。FIFO深度的选择需要权衡面积和性能。如果FIFO太浅从设备在反压主设备时会导致总线利用率下降。如果FIFO太深会占用更多的片上存储资源。一个经验法则是FIFO深度至少能够容纳一个完整的突发传输的数据量。比如最大突发长度为16拍每拍8字节那么FIFO深度至少为16位宽为8字节。如果从设备的下游处理速度较慢还需要适当增加FIFO深度以平滑数据流。8.3 地址译码如何支持多个从设备在一个典型的SoC中多个从设备共享AXI总线需要通过地址译码来选择目标从设备。地址译码逻辑通常放在互连模块中根据AWADDR或ARADDR的高位来判断目标从设备。译码逻辑需要保证地址范围不重叠且每个从设备的地址范围与其实

相关新闻

QwenPaw 终端 AI 助手实战指南:从安装到代码审查与 Git 工作流集成

QwenPaw 终端 AI 助手实战指南:从安装到代码审查与 Git 工作流集成

最近工具圈确实刮起了一阵“终端 AI 助手”的风,从 codex 到 claude code,再到今天要聊的 QwenPaw,本质上都在做同一件事:把大模型塞进命令行,让开发者不用离开终端就能写代码、改 bug、审代码。我前后试过好几个类似工…

2026/10/12 17:58:55 阅读更多 →
Codex半年实战:从CLI到云端,省Token技巧与高阶玩法全盘点

Codex半年实战:从CLI到云端,省Token技巧与高阶玩法全盘点

Codex 从发布到现在已经走了大半年,作为 OpenAI 旗下 ChatGPT 系列的命令行编程助手,它从“能在终端里帮你改代码的实验品”变成了我日常开发里离不开的角色。这篇文章不打算复述官方文档,而是把半年间我实际观察到的重要更新、我自己踩过的省…

2026/10/13 12:46:19 阅读更多 →
如何用LiveKit部署JoyAI-VL-Interaction避免暴露十几个服务端口?完整配置指南

如何用LiveKit部署JoyAI-VL-Interaction避免暴露十几个服务端口?完整配置指南

如何用LiveKit部署JoyAI-VL-Interaction避免暴露十几个服务端口?完整配置指南 【免费下载链接】JoyAI-VL-Interaction JoyAI-VL-Interaction: An Open Real-time Video-Language Interaction System 项目地址: https://gitcode.com/gh_mirrors/jo/JoyAI-VL-Intera…

2026/10/13 11:38:46 阅读更多 →

最新新闻

贪心算法实战:Prim最小生成树从原理到堆优化

贪心算法实战:Prim最小生成树从原理到堆优化

1. 从一个真实场景说起:为什么我们需要最小生成树很多人第一次接触最小生成树这个概念,是在算法课上听老师念PPT,什么“带权无向连通图”“边权和最小”“无环子图”,听完一头雾水,考试前背个模板就过去了。但如果你真…

2026/10/15 13:20:52 阅读更多 →
外贸独立站3类页面合格度,怎么用脚本一次跑完

外贸独立站3类页面合格度,怎么用脚本一次跑完

给外贸独立站做内容改版,最容易卡在验收:产品页的参数补全了没有、文章页能不能答上标题那个问题、问答页有几条。这些判断过去都靠人眼看,改完一批就没人再回头看一遍。这篇把三类页面的判断标准写成可计算的指标,配一段能跑的脚…

2026/10/15 13:20:52 阅读更多 →
SAP成本中心与内部订单:核心区别、配置逻辑与实操避坑指南

SAP成本中心与内部订单:核心区别、配置逻辑与实操避坑指南

1. 成本中心与内部订单到底在解决什么问题刚接触SAP财务模块的朋友,十有八九会在成本中心和内部订单这两个概念上卡住。我第一次配这两个东西的时候,盯着屏幕看了半天,心里想的是:不都是归集费用吗,搞两套东西出来不是…

2026/10/15 13:20:52 阅读更多 →
USB3300 ULPI PHY设计实战:高速USB接口原理图与驱动调试要点

USB3300 ULPI PHY设计实战:高速USB接口原理图与驱动调试要点

简介:面向STM32F2XX/F4XX开发者的USB3300高速USB接口控制器资料包已公开。USB3300支持USB 2.0高速传输(480Mbps),内置PHY层,适合需要快速数据交换的嵌入式场景;该压缩包既有芯片与官方板级设计文档&#xf…

2026/10/15 13:20:52 阅读更多 →
TongLINK/Q vs RabbitMQ:消息中间件运维实战与国产化迁移指南

TongLINK/Q vs RabbitMQ:消息中间件运维实战与国产化迁移指南

1. 先搞清楚定位:这两个中间件是干什么的干中间件运维这些年,我最大的感受是:很多事故不是因为中间件本身有多脆弱,而是接手的人没搞明白手里这个组件在系统里到底承担什么角色。TongLINK/Q和RabbitMQ就是典型例子——一个是国产商…

2026/10/15 13:20:52 阅读更多 →
2026知乎优质博主筛选指南:技术、产品、运营与行业盘点

2026知乎优质博主筛选指南:技术、产品、运营与行业盘点

站在 2026 年这个时间点,知乎上的互联网类内容其实已经变了好几轮。早几年大家靠"干货长文"起家,后来短视频截流、图文号被算法打压,能坚持写长文的博主本身就是一种筛选。但问题也随之而来——真正值得关注的人,往往藏…

2026/10/15 13:19:51 阅读更多 →

日新闻

Docker Compose 容器化部署 ChirpStack LoRaWAN 网络服务器实战

Docker Compose 容器化部署 ChirpStack LoRaWAN 网络服务器实战

1. 为什么选择容器化方式部署 LoRa 网络服务LoRa 物联网项目落地时,网络服务器是整个链路的核心枢纽。它负责接收网关上报的数据包、完成去重与解密、再把有效载荷分发给上层应用。早期大家习惯把网络服务器直接装在物理机上,依赖一堆系统库和特定版本的…

2026/10/15 0:00:46 阅读更多 →
共享LLM服务下的跨模型自动扩缩容:Kubernetes实战与避坑指南

共享LLM服务下的跨模型自动扩缩容:Kubernetes实战与避坑指南

1. 共享推理服务里,扩缩容到底难在哪做过大模型推理服务部署的人,大概都经历过这样的场景:一个团队共用一套推理集群,A 业务跑的是 7B 的小模型,B 业务跑的是 72B 的大模型,C 业务白天流量高、晚上几乎归零…

2026/10/15 0:00:46 阅读更多 →
Systemd 启动阶段根文件系统只读之谜:fstab 与 remount-fs 服务深度解析

Systemd 启动阶段根文件系统只读之谜:fstab 与 remount-fs 服务深度解析

1. 引子:一次内核恐慌引发的追查先从一个真实场景说起。某次我给一台老旧的嵌入式设备折腾系统裁减,为了把启动时间压进两秒以内,我手贱地把一串自认为“没用”的 systemd 服务给 disable 了,其中就包括systemd-remount-fs.servic…

2026/10/15 0:00:46 阅读更多 →

周新闻

流感时间序列预测实战:ARIMA/LSTM全流程拆解与避坑指南

流感时间序列预测实战:ARIMA/LSTM全流程拆解与避坑指南

简介:基于 ARIMA、LSTM、Transformer 等模型的流感时间序列预测 Python 源码,面向计算机相关专业课程设计与期末大作业学生,以及项目实战学习者。内容覆盖预处理、平稳性检验、定阶、残差分析、多模型对比预测的完整时序建模流程,…

2026/10/14 3:30:28 阅读更多 →
影刀RPA新手教程:键盘模拟输入实战——输入文本与模拟按键的区别

影刀RPA新手教程:键盘模拟输入实战——输入文本与模拟按键的区别

影刀RPA新手教程:键盘模拟输入实战——输入文本与模拟按键的区别 做影刀RPA自动化,十个新手有八个栽在"往输入框里填东西"这件事上:要么填不进去,要么填了一半,要么直接把原来内容追加在后面。这背后的根因&…

2026/10/14 16:30:29 阅读更多 →
影刀RPA新手教程:阅文起点小说数据采集实战——书籍信息与章节内容

影刀RPA新手教程:阅文起点小说数据采集实战——书籍信息与章节内容

影刀RPA新手教程:阅文起点小说数据采集实战——书籍信息与章节内容 1. 认识影刀:什么场景该用RPA采小说数据 起点中文网的页面结构相对稳定——分类榜单、书籍详情、章节内容三块独立页面,跳转链路清晰。这种场景非常适合影刀自动化&#x…

2026/10/14 3:29:58 阅读更多 →

月新闻

我发现了一个新思路:用 Remotion + Claude Code 像写代码一样自动化生成短视频

我发现了一个新思路:用 Remotion + Claude Code 像写代码一样自动化生成短视频

/* MD / 富文本中的 .toc(含博客园搬家等嵌套结构);.toc-box 在侧栏,不受影响 */#content_views .toc,/* 编辑器常在目录前后插入空 p(:empty 仍占 20px),一并去掉避免顶空隙 */#content_views.markdown_views > p:empty:has(+ .toc),#content_views.markdown_views …

2026/10/15 0:14:36 阅读更多 →
Windows下 Codex 中 Chrome 和 Computer Use 插件不可用问题排查及解决参考方式:TaoToken 统一 Key 配置与验证

Windows下 Codex 中 Chrome 和 Computer Use 插件不可用问题排查及解决参考方式:TaoToken 统一 Key 配置与验证

/* MD / 富文本中的 .toc(含博客园搬家等嵌套结构);.toc-box 在侧栏,不受影响 */#content_views .toc,/* 编辑器常在目录前后插入空 p(:empty 仍占 20px),一并去掉避免顶空隙 */#content_views.markdown_views > p:empty:has(+ .toc),#content_views.markdown_views …

2026/10/14 22:45:47 阅读更多 →
黑夜航拍船只数据集训练YOLOV5模型全流程解析

黑夜航拍船只数据集训练YOLOV5模型全流程解析

/* MD / 富文本中的 .toc(含博客园搬家等嵌套结构);.toc-box 在侧栏,不受影响 */#content_views .toc,/* 编辑器常在目录前后插入空 p(:empty 仍占 20px),一并去掉避免顶空隙 */#content_views.markdown_views > p:empty:has(+ .toc),#content_views.markdown_views …

2026/10/15 9:49:14 阅读更多 →